Reaction Details
TargetC-C chemokine receptor type 2
LigandBDBM50197988
Substrate/Competitorn/a
Meas. Tech.ChEMBL_453298 (CHEMBL902453)
IC50 30±n/a nM
Citation Pinkerton, ABHuang, DCube, RVHutchinson, JHStruthers, MAyala, JMVicario, PPPatel, SRWisniewski, TDeMartino, JAVernier, JM Diaryl substituted pyrazoles as potent CCR2 receptor antagonists. Bioorg Med Chem Lett17:807-13 (2007) 
 
C-C chemokine receptor type 2
Name:C-C chemokine receptor type 2
Type:Enzyme
Mol. Mass.:41932.32
Organism:Homo sapiens (Human)
Description:P41597
Residue:374
BDBM50197988
NameBDBM50197988
Synonyms:3-(3-(3,5-dichlorophenyl)-1-(naphthalen-2-yl)-1H-pyrazol-5-ylamino)-N-(5-(diethylamino)pentan-2-yl)propanamide | CHEMBL428559
TypeSmall organic molecule
Emp. Form.C31H37Cl2N5O
Mol. Mass.566.564
SMILESCCN(CC)CCCC(C)NC(=O)CCNc1cc(nn1-c1ccc2ccccc2c1)-c1cc(Cl)cc(Cl)c1