Reaction Details
TargetSodium-dependent dopamine transporter
LigandBDBM50198230
Substrate/Competitorn/a
Meas. Tech.ChEMBL_453326 (CHEMBL901476)
Ki 228±n/a nM
Citation Tamagnan, GDBrenner, EAlagille, DStaley, JKHaile, CKoren, AEarly, MBaldwin, RMTarazi, FIBaldessarini, RJJarkas, NGoodman, MMSeibyl, JP Development of SPECT imaging agents for the norepinephrine transporters: [123I]INER. Bioorg Med Chem Lett17:533-7 (2007) 
 
Sodium-dependent dopamine transporter
Name:Sodium-dependent dopamine transporter
Type:Multi-pass membrane protein
Mol. Mass.:68749.45
Organism:Rattus norvegicus (rat)
Description:P23977
Residue:619
BDBM50198230
NameBDBM50198230
Synonyms:(S)-2-((S)-(2-iodophenoxy)(phenyl)methyl)morpholine | CHEMBL393236
TypeSmall organic molecule
Emp. Form.C17H18INO2
Mol. Mass.395.2348
SMILESIc1ccccc1O[C@H]([C@@H]1CNCCO1)c1ccccc1