Reaction Details
TargetGlucagon receptor
LigandBDBM50199495
Substrate/Competitorn/a
Meas. Tech.ChEMBL_441038 (CHEMBL890125)
IC50 4.9±n/a nM
Citation Liang, RAbrardo, LBrady, EJCandelore, MRDing, VSaperstein, RTota, LMWright, MMock, STamvakopolous, CTong, SZheng, SZhang, BBTata, JRParmee, ER Design and synthesis of conformationally constrained tri-substituted ureas as potent antagonists of the human glucagon receptor. Bioorg Med Chem Lett17:587-92 (2007) 
 
Glucagon receptor
Name:Glucagon receptor
Type:Enzyme
Mol. Mass.:54026.92
Organism:Homo sapiens (Human)
Description:P47871
Residue:477
BDBM50199495
NameBDBM50199495
Synonyms:1-(5-((2H-tetrazol-5-yl)carbamoyl)-2,3-dihydro-1H-inden-1-yl)-1-((1r,4r)-4-tert-butylcyclohexyl)-3-(3,5-dichlorophenyl)urea | CHEMBL232448
TypeSmall organic molecule
Emp. Form.C28H33Cl2N7O2
Mol. Mass.570.513
SMILESCC(C)(C)[C@H]1CC[C@@H](CC1)N(C1CCc2cc(ccc12)C(=O)Nc1nnn[nH]1)C(=O)Nc1cc(Cl)cc(Cl)c1