Reaction Details
TargetAcetylcholinesterase
LigandBDBM50199519
Substrate/Competitorn/a
Meas. Tech.ChEMBL_441060 (CHEMBL890218)
pH5±n/a
IC50 52±n/a nM
Commentsextracted
Citation He, XCFeng, SWang, ZFShi, YZheng, SXia, YJiang, HTang, XCBai, D Study on dual-site inhibitors of acetylcholinesterase: Highly potent derivatives of bis- and bifunctional huperzine B. Bioorg Med Chem15:1394-408 (2007) 
 
Acetylcholinesterase
Name:Acetylcholinesterase
Type:Enzyme
Mol. Mass.:68193.62
Organism:Rattus norvegicus (rat)
Description:P37136
Residue:614
BDBM50199519
NameBDBM50199519
Synonyms:CHEMBL389579 | N,N'-dimethyl-N-(4-fluorobenzyl)-N'-(1-oxo-8,15-didehydrolycodinocarbonylmethyl)-1,10-decanediamine
TypeSmall organic molecule
Emp. Form.C37H53FN4O2
Mol. Mass.604.8407
SMILESCN(CCCCCCCCCCN(C)Cc1ccc(F)cc1)CC(=O)N1CCC[C@@H]2[C@@H]3Cc4[nH]c(=O)ccc4[C@]12CC(C)=C3