Reaction Details
TargetCarboxylic ester hydrolase
LigandBDBM50199527
Substrate/Competitorn/a
Meas. Tech.ChEMBL_441061 (CHEMBL891276)
IC50 12900±n/a nM
Citation He, XCFeng, SWang, ZFShi, YZheng, SXia, YJiang, HTang, XCBai, D Study on dual-site inhibitors of acetylcholinesterase: Highly potent derivatives of bis- and bifunctional huperzine B. Bioorg Med Chem15:1394-408 (2007) 
 
Carboxylic ester hydrolase
Name:Carboxylic ester hydrolase
Type:Enzyme
Mol. Mass.:67776.22
Organism:Rattus norvegicus (rat)
Description:n/a
Residue:597
BDBM50199527
NameBDBM50199527
Synonyms:CHEMBL244230 | N,N'-dimethyl-N-(3-pyridylmethyl)-N'-(1-oxo-8,15-didehydrolycodinocarbonylmethyl)-1,10-decanediamine
TypeSmall organic molecule
Emp. Form.C36H53N5O2
Mol. Mass.587.8383
SMILESCN(CCCCCCCCCCN(C)Cc1cccnc1)CC(=O)N1CCC[C@@H]2[C@@H]3Cc4[nH]c(=O)ccc4[C@]12CC(C)=C3