Reaction Details
TargetAcetylcholinesterase
LigandBDBM50199534
Substrate/Competitorn/a
Meas. Tech.ChEMBL_441060 (CHEMBL890218)
pH5±n/a
IC50 407±n/a nM
Commentsextracted
Citation He, XCFeng, SWang, ZFShi, YZheng, SXia, YJiang, HTang, XCBai, D Study on dual-site inhibitors of acetylcholinesterase: Highly potent derivatives of bis- and bifunctional huperzine B. Bioorg Med Chem15:1394-408 (2007) 
 
Acetylcholinesterase
Name:Acetylcholinesterase
Type:Enzyme
Mol. Mass.:68193.62
Organism:Rattus norvegicus (rat)
Description:P37136
Residue:614
BDBM50199534
NameBDBM50199534
Synonyms:CHEMBL389582 | N,N'-bis(1-oxo-8,15-didehydrolycodinoethyl)-piperazine
TypeSmall organic molecule
Emp. Form.C39H52N6O2
Mol. Mass.636.8692
SMILESCC1=C[C@H]2Cc3[nH]c(=O)ccc3[C@@]3(C1)[C@@H]2CCCN3CCN1CCN(CN2CCC[C@@H]3[C@@H]4Cc5[nH]c(=O)ccc5[C@]23CC(C)=C4)CC1