Reaction Details
TargetCarboxylic ester hydrolase
LigandBDBM50199537
Substrate/Competitorn/a
Meas. Tech.ChEMBL_441061 (CHEMBL891276)
IC50 60000±n/a nM
Citation He, XCFeng, SWang, ZFShi, YZheng, SXia, YJiang, HTang, XCBai, D Study on dual-site inhibitors of acetylcholinesterase: Highly potent derivatives of bis- and bifunctional huperzine B. Bioorg Med Chem15:1394-408 (2007) 
 
Carboxylic ester hydrolase
Name:Carboxylic ester hydrolase
Type:Enzyme
Mol. Mass.:67776.22
Organism:Rattus norvegicus (rat)
Description:n/a
Residue:597
BDBM50199537
NameBDBM50199537
Synonyms:CHEMBL395281 | N,N'-dimethyl-N,N'-bis(1-oxo-8,15-didehydrolycodinocarbonylmethyl)-1,3-propanediamine
TypeSmall organic molecule
Emp. Form.C41H54N6O4
Mol. Mass.694.9053
SMILESCN(CCCN(C)CC(=O)N1CCC[C@@H]2[C@@H]3Cc4[nH]c(=O)ccc4[C@]12CC(C)=C3)CC(=O)N1CCC[C@@H]2[C@@H]3Cc4[nH]c(=O)ccc4[C@]12CC(C)=C3