Reaction Details
TargetAcetylcholinesterase
LigandBDBM50199535
Substrate/Competitorn/a
Meas. Tech.ChEMBL_441060 (CHEMBL890218)
pH5±n/a
IC50 416±n/a nM
Commentsextracted
Citation He, XCFeng, SWang, ZFShi, YZheng, SXia, YJiang, HTang, XCBai, D Study on dual-site inhibitors of acetylcholinesterase: Highly potent derivatives of bis- and bifunctional huperzine B. Bioorg Med Chem15:1394-408 (2007) 
 
Acetylcholinesterase
Name:Acetylcholinesterase
Type:Enzyme
Mol. Mass.:68193.62
Organism:Rattus norvegicus (rat)
Description:P37136
Residue:614
BDBM50199535
NameBDBM50199535
Synonyms:CHEMBL413018 | N,N'-dimethyl-N,N'-bis[2-(1-oxo-8,15-didehydrolycodino)ethyl]-1,3-propanediamine
TypeSmall organic molecule
Emp. Form.C41H58N6O2
Mol. Mass.666.9382
SMILESCN(CCCN(C)CCN1CCC[C@@H]2[C@@H]3Cc4[nH]c(=O)ccc4[C@]12CC(C)=C3)CCN1CCC[C@@H]2[C@@H]3Cc4[nH]c(=O)ccc4[C@]12CC(C)=C3