Reaction Details
TargetDelta-type opioid receptor
LigandBDBM50199861
Substrate/Competitorn/a
Meas. Tech.ChEMBL_441143 (CHEMBL891362)
Ki 560±n/a nM
Citation Li, TJinsmaa, YNedachi, MMiyazaki, ATsuda, YAmbo, ASasaki, YBryant, SDMarczak, ELi, QSwartzwelder, HSLazarus, LHOkada, Y Transformation of mu-opioid receptor agonists into biologically potent mu-opioid receptor antagonists. Bioorg Med Chem15:1237-51 (2007) 
 
Delta-type opioid receptor
Name:Delta-type opioid receptor
Type:G Protein-Coupled Receptor (GPCR)
Mol. Mass.:40465.04
Organism:Rattus norvegicus (rat)
Description:Competition binding assays were using CHO-K1 cell membranes expressing the opioid receptor.
Residue:372
BDBM50199861
NameBDBM50199861
Synonyms:(S)-1-((S)-2-(allylamino)-3-(4-hydroxy-2,6-dimethylphenyl)propanoyl)-N-((S)-1-((S)-1-amino-1-oxo-3-phenylpropan-2-ylamino)-1-oxo-3-phenylpropan-2-yl)pyrrolidine-2-carboxamide | CHEMBL412922
TypeSmall organic molecule
Emp. Form.C37H45N5O5
Mol. Mass.639.7837
SMILESCc1cc(O)cc(C)c1C[C@H](NCC=C)C(=O)N1CCC[C@H]1C(=O)N[C@@H](Cc1ccccc1)C(=O)N[C@@H](Cc1ccccc1)C(N)=O