Reaction Details
TargetDelta-type opioid receptor
LigandBDBM50199864
Substrate/Competitorn/a
Meas. Tech.ChEMBL_441147 (CHEMBL891366)
IC50>10000±n/a nM
Citation Li, TJinsmaa, YNedachi, MMiyazaki, ATsuda, YAmbo, ASasaki, YBryant, SDMarczak, ELi, QSwartzwelder, HSLazarus, LHOkada, Y Transformation of mu-opioid receptor agonists into biologically potent mu-opioid receptor antagonists. Bioorg Med Chem15:1237-51 (2007) 
 
Delta-type opioid receptor
Name:Delta-type opioid receptor
Type:Enzyme Catalytic Domain
Mol. Mass.:40577.25
Organism:MOUSE
Description:P32300
Residue:372
BDBM50199864
NameBDBM50199864
Synonyms:(S)-N-((S)-1-((S)-1-(allylamino)-1-oxo-3-phenylpropan-2-ylamino)-1-oxo-3-phenylpropan-2-yl)-1-((S)-2-(allylamino)-3-(4-hydroxy-2,6-dimethylphenyl)propanoyl)pyrrolidine-2-carboxamide | CHEMBL397176
TypeSmall organic molecule
Emp. Form.C40H49N5O5
Mol. Mass.679.8476
SMILESCc1cc(O)cc(C)c1C[C@H](NCC=C)C(=O)N1CCC[C@H]1C(=O)N[C@@H](Cc1ccccc1)C(=O)N[C@@H](Cc1ccccc1)C(=O)NCC=C