Reaction Details
TargetDelta-type opioid receptor
LigandBDBM50199866
Substrate/Competitorn/a
Meas. Tech.ChEMBL_441143 (CHEMBL891362)
Ki 5755±n/a nM
Citation Li, TJinsmaa, YNedachi, MMiyazaki, ATsuda, YAmbo, ASasaki, YBryant, SDMarczak, ELi, QSwartzwelder, HSLazarus, LHOkada, Y Transformation of mu-opioid receptor agonists into biologically potent mu-opioid receptor antagonists. Bioorg Med Chem15:1237-51 (2007) 
 
Delta-type opioid receptor
Name:Delta-type opioid receptor
Type:G Protein-Coupled Receptor (GPCR)
Mol. Mass.:40465.04
Organism:Rattus norvegicus (rat)
Description:Competition binding assays were using CHO-K1 cell membranes expressing the opioid receptor.
Residue:372
BDBM50199866
NameBDBM50199866
Synonyms:(S)-N-((S)-1-((S)-1-(allylamino)-1-oxo-3-phenylpropan-2-ylamino)-1-oxo-3-phenylpropan-2-yl)-1-((S)-2-(allylamino)-3-(4-hydroxyphenyl)propanoyl)pyrrolidine-2-carboxamide | CHEMBL412921
TypeSmall organic molecule
Emp. Form.C38H45N5O5
Mol. Mass.651.7944
SMILESOc1ccc(C[C@H](NCC=C)C(=O)N2CCC[C@H]2C(=O)N[C@@H](Cc2ccccc2)C(=O)N[C@@H](Cc2ccccc2)C(=O)NCC=C)cc1