Reaction Details
TargetMu-type opioid receptor
LigandBDBM50199859
Substrate/Competitorn/a
Meas. Tech.ChEMBL_441142 (CHEMBL891361)
Ki 4.6±n/a nM
Citation Li, TJinsmaa, YNedachi, MMiyazaki, ATsuda, YAmbo, ASasaki, YBryant, SDMarczak, ELi, QSwartzwelder, HSLazarus, LHOkada, Y Transformation of mu-opioid receptor agonists into biologically potent mu-opioid receptor antagonists. Bioorg Med Chem15:1237-51 (2007) 
 
Mu-type opioid receptor
Name:Mu-type opioid receptor
Type:G Protein-Coupled Receptor (GPCR)
Mol. Mass.:44503.11
Organism:Rattus norvegicus (rat)
Description:Competition binding assays were carried out using membrane preparations from transfected HN9.10 cells that constitutively expressed the mu opioid receptor.
Residue:398
BDBM50199859
NameBDBM50199859
Synonyms:(S)-N-((S)-1-((S)-1-(allylamino)-1-oxo-3-phenylpropan-2-ylamino)-3-(1H-indol-3-yl)-1-oxopropan-2-yl)-1-((S)-2-(allylamino)-3-(4-hydroxy-2,6-dimethylphenyl)propanoyl)pyrrolidine-2-carboxamide | CHEMBL397177
TypeSmall organic molecule
Emp. Form.C42H50N6O5
Mol. Mass.718.8836
SMILESCc1cc(O)cc(C)c1C[C@H](NCC=C)C(=O)N1CCC[C@H]1C(=O)N[C@@H](Cc1c[nH]c2ccccc12)C(=O)N[C@@H](Cc1ccccc1)C(=O)NCC=C