Reaction Details
TargetDelta-type opioid receptor
LigandBDBM50199867
Substrate/Competitorn/a
Meas. Tech.ChEMBL_441143 (CHEMBL891362)
Ki 77.8±n/a nM
Citation Li, TJinsmaa, YNedachi, MMiyazaki, ATsuda, YAmbo, ASasaki, YBryant, SDMarczak, ELi, QSwartzwelder, HSLazarus, LHOkada, Y Transformation of mu-opioid receptor agonists into biologically potent mu-opioid receptor antagonists. Bioorg Med Chem15:1237-51 (2007) 
 
Delta-type opioid receptor
Name:Delta-type opioid receptor
Type:G Protein-Coupled Receptor (GPCR)
Mol. Mass.:40465.04
Organism:Rattus norvegicus (rat)
Description:Competition binding assays were using CHO-K1 cell membranes expressing the opioid receptor.
Residue:372
BDBM50199867
NameBDBM50199867
Synonyms:(S)-2-allylamino-N-(5-{[(S)-2-allylamino-3-(4-hydroxy-2,6-dimethyl-phenyl)-propionyl]-propyl-amino}-3-oxo-3,4-dihydro-pyrazin-2-yl)-3-(4-hydroxy-2,6-dimethyl-phenyl)-N-propyl-propionamide | CHEMBL396506
TypeSmall organic molecule
Emp. Form.C38H52N6O5
Mol. Mass.672.8567
SMILESCCCN(C(=O)[C@H](Cc1c(C)cc(O)cc1C)NCC=C)c1cnc(N(CCC)C(=O)[C@H](Cc2c(C)cc(O)cc2C)NCC=C)c(=O)[nH]1