Reaction Details
TargetMu-type opioid receptor
LigandBDBM50199862
Substrate/Competitorn/a
Meas. Tech.ChEMBL_441142 (CHEMBL891361)
Ki 12.4±n/a nM
Citation Li, TJinsmaa, YNedachi, MMiyazaki, ATsuda, YAmbo, ASasaki, YBryant, SDMarczak, ELi, QSwartzwelder, HSLazarus, LHOkada, Y Transformation of mu-opioid receptor agonists into biologically potent mu-opioid receptor antagonists. Bioorg Med Chem15:1237-51 (2007) 
 
Mu-type opioid receptor
Name:Mu-type opioid receptor
Type:G Protein-Coupled Receptor (GPCR)
Mol. Mass.:44503.11
Organism:Rattus norvegicus (rat)
Description:Competition binding assays were carried out using membrane preparations from transfected HN9.10 cells that constitutively expressed the mu opioid receptor.
Residue:398
BDBM50199862
NameBDBM50199862
Synonyms:(S)-2-allylamino-N-{6-[(S)-2-allylamino-3-(4-hydroxy-phenyl)-propionylamino]-hexyl}-3-(4-hydroxy-phenyl)-propionamide | CHEMBL232303
TypeSmall organic molecule
Emp. Form.C30H42N4O4
Mol. Mass.522.6789
SMILESOc1ccc(C[C@H](NCC=C)C(=O)NCCCCCCNC(=O)[C@H](Cc2ccc(O)cc2)NCC=C)cc1