Reaction Details
TargetMu-type opioid receptor
LigandBDBM50199867
Substrate/Competitorn/a
Meas. Tech.ChEMBL_441145 (CHEMBL891364)
IC50>10000±n/a nM
Citation Li, TJinsmaa, YNedachi, MMiyazaki, ATsuda, YAmbo, ASasaki, YBryant, SDMarczak, ELi, QSwartzwelder, HSLazarus, LHOkada, Y Transformation of mu-opioid receptor agonists into biologically potent mu-opioid receptor antagonists. Bioorg Med Chem15:1237-51 (2007) 
 
Mu-type opioid receptor
Name:Mu-type opioid receptor
Type:Enzyme Catalytic Domain
Mol. Mass.:11165.58
Organism:GUINEA PIG
Description:P97266
Residue:98
BDBM50199867
NameBDBM50199867
Synonyms:(S)-2-allylamino-N-(5-{[(S)-2-allylamino-3-(4-hydroxy-2,6-dimethyl-phenyl)-propionyl]-propyl-amino}-3-oxo-3,4-dihydro-pyrazin-2-yl)-3-(4-hydroxy-2,6-dimethyl-phenyl)-N-propyl-propionamide | CHEMBL396506
TypeSmall organic molecule
Emp. Form.C38H52N6O5
Mol. Mass.672.8567
SMILESCCCN(C(=O)[C@H](Cc1c(C)cc(O)cc1C)NCC=C)c1cnc(N(CCC)C(=O)[C@H](Cc2c(C)cc(O)cc2C)NCC=C)c(=O)[nH]1