Reaction Details
TargetDelta-type opioid receptor
LigandBDBM50199860
Substrate/Competitorn/a
Meas. Tech.ChEMBL_441143 (CHEMBL891362)
Ki 7358±n/a nM
Citation Li, TJinsmaa, YNedachi, MMiyazaki, ATsuda, YAmbo, ASasaki, YBryant, SDMarczak, ELi, QSwartzwelder, HSLazarus, LHOkada, Y Transformation of mu-opioid receptor agonists into biologically potent mu-opioid receptor antagonists. Bioorg Med Chem15:1237-51 (2007) 
 
Delta-type opioid receptor
Name:Delta-type opioid receptor
Type:G Protein-Coupled Receptor (GPCR)
Mol. Mass.:40465.04
Organism:Rattus norvegicus (rat)
Description:Competition binding assays were using CHO-K1 cell membranes expressing the opioid receptor.
Residue:372
BDBM50199860
NameBDBM50199860
Synonyms:(S)-1-((S)-2-(allylamino)-3-(4-hydroxyphenyl)propanoyl)-N-((S)-1-((S)-1-amino-1-oxo-3-phenylpropan-2-ylamino)-1-oxo-3-phenylpropan-2-yl)pyrrolidine-2-carboxamide | CHEMBL266988
TypeSmall organic molecule
Emp. Form.C35H41N5O5
Mol. Mass.611.7305
SMILESNC(=O)[C@H](Cc1ccccc1)NC(=O)[C@H](Cc1ccccc1)NC(=O)[C@@H]1CCCN1C(=O)[C@H](Cc1ccc(O)cc1)NCC=C