Reaction Details
TargetDelta-type opioid receptor
LigandBDBM50199862
Substrate/Competitorn/a
Meas. Tech.ChEMBL_441143 (CHEMBL891362)
Ki 51.5±n/a nM
Citation Li, TJinsmaa, YNedachi, MMiyazaki, ATsuda, YAmbo, ASasaki, YBryant, SDMarczak, ELi, QSwartzwelder, HSLazarus, LHOkada, Y Transformation of mu-opioid receptor agonists into biologically potent mu-opioid receptor antagonists. Bioorg Med Chem15:1237-51 (2007) 
 
Delta-type opioid receptor
Name:Delta-type opioid receptor
Type:G Protein-Coupled Receptor (GPCR)
Mol. Mass.:40465.04
Organism:Rattus norvegicus (rat)
Description:Competition binding assays were using CHO-K1 cell membranes expressing the opioid receptor.
Residue:372
BDBM50199862
NameBDBM50199862
Synonyms:(S)-2-allylamino-N-{6-[(S)-2-allylamino-3-(4-hydroxy-phenyl)-propionylamino]-hexyl}-3-(4-hydroxy-phenyl)-propionamide | CHEMBL232303
TypeSmall organic molecule
Emp. Form.C30H42N4O4
Mol. Mass.522.6789
SMILESOc1ccc(C[C@H](NCC=C)C(=O)NCCCCCCNC(=O)[C@H](Cc2ccc(O)cc2)NCC=C)cc1