Reaction Details
TargetMu-type opioid receptor
LigandBDBM50199867
Substrate/Competitorn/a
Meas. Tech.ChEMBL_441142 (CHEMBL891361)
Ki 6.94±n/a nM
Citation Li, TJinsmaa, YNedachi, MMiyazaki, ATsuda, YAmbo, ASasaki, YBryant, SDMarczak, ELi, QSwartzwelder, HSLazarus, LHOkada, Y Transformation of mu-opioid receptor agonists into biologically potent mu-opioid receptor antagonists. Bioorg Med Chem15:1237-51 (2007) 
 
Mu-type opioid receptor
Name:Mu-type opioid receptor
Type:G Protein-Coupled Receptor (GPCR)
Mol. Mass.:44503.11
Organism:Rattus norvegicus (rat)
Description:Competition binding assays were carried out using membrane preparations from transfected HN9.10 cells that constitutively expressed the mu opioid receptor.
Residue:398
BDBM50199867
NameBDBM50199867
Synonyms:(S)-2-allylamino-N-(5-{[(S)-2-allylamino-3-(4-hydroxy-2,6-dimethyl-phenyl)-propionyl]-propyl-amino}-3-oxo-3,4-dihydro-pyrazin-2-yl)-3-(4-hydroxy-2,6-dimethyl-phenyl)-N-propyl-propionamide | CHEMBL396506
TypeSmall organic molecule
Emp. Form.C38H52N6O5
Mol. Mass.672.8567
SMILESCCCN(C(=O)[C@H](Cc1c(C)cc(O)cc1C)NCC=C)c1cnc(N(CCC)C(=O)[C@H](Cc2c(C)cc(O)cc2C)NCC=C)c(=O)[nH]1