Reaction Details
TargetNAD-dependent protein deacetylase sirtuin-2
LigandBDBM2683
Substrate/Competitorn/a
Meas. Tech.ChEMBL_422393 (CHEMBL909821)
IC50 7300±n/a nM
Citation Trapp, JJochum, AMeier, RSaunders, LMarshall, BKunick, CVerdin, EGoekjian, PSippl, WJung, M Adenosine mimetics as inhibitors of NAD+-dependent histone deacetylases, from kinase to sirtuin inhibition. J Med Chem49:7307-16 (2006) 
 
NAD-dependent protein deacetylase sirtuin-2
Name:NAD-dependent protein deacetylase sirtuin-2
Type:Hydrolase
Mol. Mass.:43172.62
Organism:Homo sapiens (Human)
Description:n/a
Residue:389
BDBM2683
NameBDBM2683
Synonyms:2-[1-(3-dimethylaminopropyl)-indol-3-yl]-3-(indol-3-yl)maleimide BIM-1 GF 109203X | JMC526193 Compound 2
TypeSmall organic molecule
Emp. Form.C25H24N4O2
Mol. Mass.412.4837
SMILESCN(C)CCCn1cc(C2=C(C(=O)NC2=O)c2c[nH]c3ccccc23)c2ccccc12