Reaction Details
TargetMelanocortin receptor 5
LigandBDBM50184359
Substrate/Competitorn/a
Meas. Tech.ChEMBL_410064 (CHEMBL907167)
EC50 3.3±n/a nM
Citation Ying, JGu, XCai, MDedek, MVagner, JTrivedi, DBHruby, VJ Design, synthesis, and biological evaluation of new cyclic melanotropin peptide analogues selective for the human melanocortin-4 receptor. J Med Chem49:6888-96 (2006) 
 
Melanocortin receptor 5
Name:Melanocortin receptor 5
Type:Enzyme
Mol. Mass.:36612.92
Organism:Homo sapiens (Human)
Description:P33032
Residue:325
BDBM50184359
NameBDBM50184359
Synonyms:(3S,6S,9R,12S,15S,23S)-15-((S)-2-acetylamino-hexanoylamino)-9-benzyl-6-(3-guanidino-propyl)-12-(3H-imidazol-4-ylmethyl)-3-(1H-indol-3-ylmethyl)-2,5,8,11,14,17-hexaoxo-1,4,7,10,13,18hexaaza-cyclotricosane-23-carboxylic acid amide Ac-Nle-c[Asp-His-DPhe-Arg-Trp-Lys]-NH2 MT-II | ebi_340792
TypeSmall organic molecule
Emp. Form.C50H69N15O9
Mol. Mass.1024.178
SMILESCCCC[C@H](NC(C)=O)C(=O)N[C@H]1CC(=O)NCCCC[C@H](NC(=O)[C@H](Cc2c[nH]c3ccccc23)NC(=O)[C@H](CCCN=C(N)N)NC(=O)[C@@H](Cc2ccccc2)NC(=O)[C@H](Cc2cnc[nH]2)NC1=O)C(N)=O