Reaction Details
TargetGag-Pol polyprotein [489-587]
LigandBDBM50200944
Substrate/Competitorn/a
Meas. Tech.ChEMBL_422734 (CHEMBL854830)
Ki 21±n/a nM
Citation Whiting, MTripp, JCLin, YCLindstrom, WOlson, AJElder, JHSharpless, KBFokin, VV Rapid discovery and structure-activity profiling of novel inhibitors of human immunodeficiency virus type 1 protease enabled by the copper(I)-catalyzed synthesis of 1,2,3-triazoles and their further functionalization. J Med Chem49:7697-710 (2006) 
 
Gag-Pol polyprotein [489-587]
Name:Gag-Pol polyprotein [489-587]
Type:Enzyme Subunit
Mol. Mass.:10781.16
Organism:Human immunodeficiency virus type 1
Description:P04585[489-587]
Residue:99
BDBM50200944
NameBDBM50200944
Synonyms:CHEMBL407802 | cyclopentyl (2S,3S)-3-(4-((4-(5-chloro-2-methylphenyl)piperazin-1-yl)methyl)-5-((S)1-hydroxyethyl)-1H-1,2,3-triazol-1-yl)-1,4-diphenylbutan-2-ylcarbamate
TypeSmall organic molecule
Emp. Form.C38H47ClN6O3
Mol. Mass.671.271
SMILESC[C@H](O)c1c(CN2CCN(CC2)c2cc(Cl)ccc2C)nnn1[C@@H](Cc1ccccc1)[C@H](Cc1ccccc1)NC(=O)OC1CCCC1