Reaction Details
TargetGag-Pol polyprotein [489-587]
LigandBDBM50200950
Substrate/Competitorn/a
Meas. Tech.ChEMBL_422734 (CHEMBL854830)
Ki 83±n/a nM
Citation Whiting, MTripp, JCLin, YCLindstrom, WOlson, AJElder, JHSharpless, KBFokin, VV Rapid discovery and structure-activity profiling of novel inhibitors of human immunodeficiency virus type 1 protease enabled by the copper(I)-catalyzed synthesis of 1,2,3-triazoles and their further functionalization. J Med Chem49:7697-710 (2006) 
 
Gag-Pol polyprotein [489-587]
Name:Gag-Pol polyprotein [489-587]
Type:Enzyme Subunit
Mol. Mass.:10781.16
Organism:Human immunodeficiency virus type 1
Description:P04585[489-587]
Residue:99
BDBM50200950
NameBDBM50200950
Synonyms:(R)-tetrahydrofuran-3-yl (2S,3S)-3-(4-((4-(5-chloro-2-methylphenyl)piperazin-1-yl)methyl)-1H-1,2,3-triazol-1-yl)-1,4-diphenylbutan-2-ylcarbamate | CHEMBL386848
TypeSmall organic molecule
Emp. Form.C35H41ClN6O3
Mol. Mass.629.191
SMILESCc1ccc(Cl)cc1N1CCN(Cc2cn(nn2)[C@@H](Cc2ccccc2)[C@H](Cc2ccccc2)NC(=O)O[C@@H]2CCOC2)CC1