Reaction Details
TargetPeroxisome proliferator-activated receptor alpha
LigandBDBM50202583
Substrate/Competitorn/a
Meas. Tech.ChEMBL_423813 (CHEMBL911274)
EC50 100±n/a nM
Citation Cano, CPavón, JSerrano, AGoya, PPaez, JAde Fonseca, FRMacias-Gonzalez, M Novel sulfamide analogs of oleoylethanolamide showing in vivo satiety inducing actions and PPARalpha activation. J Med Chem50:389-93 (2007) 
 
Peroxisome proliferator-activated receptor alpha
Name:Peroxisome proliferator-activated receptor alpha
Type:Enzyme
Mol. Mass.:52222.08
Organism:Homo sapiens (Human)
Description:Q07869
Residue:468
BDBM50202583
NameBDBM50202583
Synonyms:CHEMBL219156 | N-octadecyl-N'-propylsulfamide
TypeSmall organic molecule
Emp. Form.C21H46N2O2S
Mol. Mass.390.667
(=O)(=O)NCCC