Reaction Details
TargetAdenosine receptor A2a
LigandBDBM50202983
Substrate/Competitorn/a
Meas. Tech.ChEMBL_454087 (CHEMBL903278)
Ki 1.6±n/a nM
Citation Neustadt, BRHao, JLindo, NGreenlee, WJStamford, AWTulshian, DOngini, EHunter, JMonopoli, ABertorelli, RFoster, CArik, LLachowicz, JNg, KFeng, KI Potent, selective, and orally active adenosine A2A receptor antagonists: arylpiperazine derivatives of pyrazolo[4,3-e]-1,2,4-triazolo[1,5-c]pyrimidines. Bioorg Med Chem Lett17:1376-80 (2007) 
 
Adenosine receptor A2a
Name:Adenosine receptor A2a
Type:G Protein-Coupled Receptor (GPCR)
Mol. Mass.:44716.46
Organism:Homo sapiens (Human)
Description:P29274
Residue:412
BDBM50202983
NameBDBM50202983
Synonyms:2-furan-2-yl-7-(2-{4-[4-(2-methoxy-propoxy)-phenyl]-piperazin-1-yl}-ethyl)-7H-pyrazolo[4,3-e][1,2,4]triazolo[1,5-c]pyrimidin-5-ylamine | CHEMBL240626
TypeSmall organic molecule
Emp. Form.C26H31N9O3
Mol. Mass.517.5828
SMILESCOC(C)COc1ccc(cc1)N1CCN(CCn2ncc3c2nc(N)n2nc(nc32)-c2ccco2)CC1