Reaction Details
TargetAminopeptidase N
LigandBDBM50204159
Substrate/Competitorn/a
Meas. Tech.ChEMBL_438276 (CHEMBL887382)
IC50 550±n/a nM
Citation Drag, MGrzywa, ROleksyszyn, J Novel hydroxamic acid-related phosphinates: inhibition of neutral aminopeptidase N (APN). Bioorg Med Chem Lett17:1516-9 (2007) 
 
Aminopeptidase N
Name:Aminopeptidase N
Type:PROTEIN
Mol. Mass.:109522.63
Organism:Homo sapiens (Human)
Description:ChEMBL_1507526
Residue:967
BDBM50204159
NameBDBM50204159
Synonyms:CHEMBL226863 | alpha1-(1-amino-1-phenylmethane)-alpha2-(1-hydroxy-1-phenylmethane) phosphinic acid
TypeSmall organic molecule
Emp. Form.C16H20NO3P
Mol. Mass.305.3087
SMILESNC(Cc1ccccc1)P(O)(O)C(=O)Cc1ccccc1