Reaction Details
TargetCannabinoid receptor 2
LigandBDBM50204189
Substrate/Competitorn/a
Meas. Tech.ChEMBL_454343 (CHEMBL903521)
IC50 1700±n/a nM
Citation Madsen-Duggan, CBDebenham, JSWalsh, TFToupence, RBHuang, SXWang, JTong, XLao, JFong, TMSchaeffer, MTXiao, JCHuang, CRShen, CPStribling, DSShearman, LPStrack, AMMacIntyre, DEVan der Ploeg, LHGoulet, MT Lead optimization of 5,6-diarylpyridines as CB1 receptor inverse agonists. Bioorg Med Chem Lett17:2031-5 (2007) 
 
Cannabinoid receptor 2
Name:Cannabinoid receptor 2
Type:G Protein-Coupled Receptor (GPCR)
Mol. Mass.:39690.94
Organism:Homo sapiens (Human)
Description:P34972
Residue:360
BDBM50204189
NameBDBM50204189
Synonyms:CHEMBL247706 | N-(5-(4-chlorophenyl)-3-cyano-6-(2,4-dichlorophenyl)pyridin-2-yl)pivalamide
TypeSmall organic molecule
Emp. Form.C23H18Cl3N3O
Mol. Mass.458.768
SMILESCC(C)(C)C(=O)Nc1nc(-c2ccc(Cl)cc2Cl)c(cc1C#N)-c1ccc(Cl)cc1