Reaction Details
TargetCannabinoid receptor 2
LigandBDBM50204199
Substrate/Competitorn/a
Meas. Tech.ChEMBL_454343 (CHEMBL903521)
IC50 3800±n/a nM
Citation Madsen-Duggan, CBDebenham, JSWalsh, TFToupence, RBHuang, SXWang, JTong, XLao, JFong, TMSchaeffer, MTXiao, JCHuang, CRShen, CPStribling, DSShearman, LPStrack, AMMacIntyre, DEVan der Ploeg, LHGoulet, MT Lead optimization of 5,6-diarylpyridines as CB1 receptor inverse agonists. Bioorg Med Chem Lett17:2031-5 (2007) 
 
Cannabinoid receptor 2
Name:Cannabinoid receptor 2
Type:G Protein-Coupled Receptor (GPCR)
Mol. Mass.:39690.94
Organism:Homo sapiens (Human)
Description:P34972
Residue:360
BDBM50204199
NameBDBM50204199
Synonyms:5-(4-chlorophenyl)-6-(2,4-dichlorophenyl)-2-(4-methoxyphenoxy)nicotinonitrile | CHEMBL246722
TypeSmall organic molecule
Emp. Form.C25H15Cl3N2O2
Mol. Mass.481.758
SMILESCOc1ccc(Oc2nc(-c3ccc(Cl)cc3Cl)c(cc2C#N)-c2ccc(Cl)cc2)cc1