Reaction Details
TargetCannabinoid receptor 1
LigandBDBM50204193
Substrate/Competitorn/a
Meas. Tech.ChEMBL_454342 (CHEMBL903520)
IC50 37±n/a nM
Citation Madsen-Duggan, CBDebenham, JSWalsh, TFToupence, RBHuang, SXWang, JTong, XLao, JFong, TMSchaeffer, MTXiao, JCHuang, CRShen, CPStribling, DSShearman, LPStrack, AMMacIntyre, DEVan der Ploeg, LHGoulet, MT Lead optimization of 5,6-diarylpyridines as CB1 receptor inverse agonists. Bioorg Med Chem Lett17:2031-5 (2007) 
 
Cannabinoid receptor 1
Name:Cannabinoid receptor 1
Type:G Protein-Coupled Receptor (GPCR)
Mol. Mass.:52868.96
Organism:Homo sapiens (Human)
Description:P21554
Residue:472
BDBM50204193
NameBDBM50204193
Synonyms:6-(2-chlorophenyl)-5-(4-chlorophenyl)-2-(4-pivaloylpiperazin-1-yl)nicotinonitrile | CHEMBL246686
TypeSmall organic molecule
Emp. Form.C27H26Cl2N4O
Mol. Mass.493.428
SMILESCC(C)(C)C(=O)N1CCN(CC1)c1nc(-c2ccccc2Cl)c(cc1C#N)-c1ccc(Cl)cc1