Reaction Details
TargetCannabinoid receptor 2
LigandBDBM50204197
Substrate/Competitorn/a
Meas. Tech.ChEMBL_454343 (CHEMBL903521)
IC50 430±n/a nM
Citation Madsen-Duggan, CBDebenham, JSWalsh, TFToupence, RBHuang, SXWang, JTong, XLao, JFong, TMSchaeffer, MTXiao, JCHuang, CRShen, CPStribling, DSShearman, LPStrack, AMMacIntyre, DEVan der Ploeg, LHGoulet, MT Lead optimization of 5,6-diarylpyridines as CB1 receptor inverse agonists. Bioorg Med Chem Lett17:2031-5 (2007) 
 
Cannabinoid receptor 2
Name:Cannabinoid receptor 2
Type:G Protein-Coupled Receptor (GPCR)
Mol. Mass.:39690.94
Organism:Homo sapiens (Human)
Description:P34972
Residue:360
BDBM50204197
NameBDBM50204197
Synonyms:5-(4-chlorophenyl)-6-(2,4-dichlorophenyl)-2-((tetrahydrofuran-3-yl)methoxy)nicotinonitrile | CHEMBL397119
TypeSmall organic molecule
Emp. Form.C23H17Cl3N2O2
Mol. Mass.459.752
SMILESClc1ccc(cc1)-c1cc(C#N)c(OCC2CCOC2)nc1-c1ccc(Cl)cc1Cl