Reaction Details
TargetCannabinoid receptor 1
LigandBDBM50204203
Substrate/Competitorn/a
Meas. Tech.ChEMBL_454342 (CHEMBL903520)
IC50 38±n/a nM
Citation Madsen-Duggan, CBDebenham, JSWalsh, TFToupence, RBHuang, SXWang, JTong, XLao, JFong, TMSchaeffer, MTXiao, JCHuang, CRShen, CPStribling, DSShearman, LPStrack, AMMacIntyre, DEVan der Ploeg, LHGoulet, MT Lead optimization of 5,6-diarylpyridines as CB1 receptor inverse agonists. Bioorg Med Chem Lett17:2031-5 (2007) 
 
Cannabinoid receptor 1
Name:Cannabinoid receptor 1
Type:G Protein-Coupled Receptor (GPCR)
Mol. Mass.:52868.96
Organism:Homo sapiens (Human)
Description:P21554
Residue:472
BDBM50204203
NameBDBM50204203
Synonyms:6-(2-chlorophenyl)-5-(4-chlorophenyl)-2-(pyrimidin-5-yl)nicotinonitrile | CHEMBL393262
TypeSmall organic molecule
Emp. Form.C22H12Cl2N4
Mol. Mass.403.263
SMILESClc1ccc(cc1)-c1cc(C#N)c(nc1-c1ccccc1Cl)-c1cncnc1