Reaction Details
TargetCannabinoid receptor 1
LigandBDBM50160138
Substrate/Competitorn/a
Meas. Tech.ChEMBL_454342 (CHEMBL903520)
IC50 8±n/a nM
Citation Madsen-Duggan, CBDebenham, JSWalsh, TFToupence, RBHuang, SXWang, JTong, XLao, JFong, TMSchaeffer, MTXiao, JCHuang, CRShen, CPStribling, DSShearman, LPStrack, AMMacIntyre, DEVan der Ploeg, LHGoulet, MT Lead optimization of 5,6-diarylpyridines as CB1 receptor inverse agonists. Bioorg Med Chem Lett17:2031-5 (2007) 
 
Cannabinoid receptor 1
Name:Cannabinoid receptor 1
Type:G Protein-Coupled Receptor (GPCR)
Mol. Mass.:52868.96
Organism:Homo sapiens (Human)
Description:P21554
Residue:472
BDBM50160138
NameBDBM50160138
Synonyms:2-(3,4-difluorobenzyloxy)-6-(2-chlorophenyl)-5-(4-chlorophenyl)nicotinonitrile CHEMBL179787
TypeSmall organic molecule
Emp. Form.C25H14Cl2F2N2O
Mol. Mass.467.294
SMILESFc1ccc(COc2nc(-c3ccccc3Cl)c(cc2C#N)-c2ccc(Cl)cc2)cc1F