Reaction Details
TargetProstaglandin E2 receptor EP1 subtype
LigandBDBM50205276
Substrate/Competitorn/a
Meas. Tech.ChEMBL_425872 (CHEMBL856876)
Ki>9000±n/a nM
Citation Sturino, CFO'Neill, GLachance, NBoyd, MBerthelette, CLabelle, MLi, LRoy, BScheigetz, JTsou, NAubin, YBateman, KPChauret, NDay, SHLévesque, JFSeto, CSilva, JHTrimble, LACarriere, MCDenis, DGreig, GKargman, SLamontagne, SMathieu, MCSawyer, NSlipetz, DAbraham, WMJones, TMcAuliffe, MPiechuta, HNicoll-Griffith, DAWang, ZZamboni, RYoung, RNMetters, KM Discovery of a potent and selective prostaglandin D2 receptor antagonist, [(3R)-4-(4-chloro-benzyl)-7-fluoro-5-(methylsulfonyl)-1,2,3,4-tetrahydrocyclopenta[b]indol-3-yl]-acetic acid (MK-0524). J Med Chem50:794-806 (2007) 
 
Prostaglandin E2 receptor EP1 subtype
Name:Prostaglandin E2 receptor EP1 subtype
Type:Enzyme
Mol. Mass.:41834.57
Organism:Homo sapiens (Human)
Description:P34995
Residue:402
BDBM50205276
NameBDBM50205276
Synonyms:CHEMBL385126 | [(3R)-4-(4-chlorobenzyl)-7-fluoro-5-acetyl-1,2,3,4-tetrahydrocyclopenta-[b]indol-3-yl]acetic acid
TypeSmall organic molecule
Emp. Form.C22H19ClFNO3
Mol. Mass.399.843
SMILESCC(=O)c1cc(F)cc2c3CC[C@H](CC(O)=O)c3n(Cc3ccc(Cl)cc3)c12