Reaction Details
TargetThromboxane A2 receptor
LigandBDBM50205276
Substrate/Competitorn/a
Meas. Tech.ChEMBL_425871 (CHEMBL856875)
Ki 14±n/a nM
Citation Sturino, CFO'Neill, GLachance, NBoyd, MBerthelette, CLabelle, MLi, LRoy, BScheigetz, JTsou, NAubin, YBateman, KPChauret, NDay, SHLévesque, JFSeto, CSilva, JHTrimble, LACarriere, MCDenis, DGreig, GKargman, SLamontagne, SMathieu, MCSawyer, NSlipetz, DAbraham, WMJones, TMcAuliffe, MPiechuta, HNicoll-Griffith, DAWang, ZZamboni, RYoung, RNMetters, KM Discovery of a potent and selective prostaglandin D2 receptor antagonist, [(3R)-4-(4-chloro-benzyl)-7-fluoro-5-(methylsulfonyl)-1,2,3,4-tetrahydrocyclopenta[b]indol-3-yl]-acetic acid (MK-0524). J Med Chem50:794-806 (2007) 
 
Thromboxane A2 receptor
Name:Thromboxane A2 receptor
Type:Enyzme
Mol. Mass.:37445.28
Organism:Homo sapiens (Human)
Description:P21731
Residue:343
BDBM50205276
NameBDBM50205276
Synonyms:CHEMBL385126 | [(3R)-4-(4-chlorobenzyl)-7-fluoro-5-acetyl-1,2,3,4-tetrahydrocyclopenta-[b]indol-3-yl]acetic acid
TypeSmall organic molecule
Emp. Form.C22H19ClFNO3
Mol. Mass.399.843
SMILESCC(=O)c1cc(F)cc2c3CC[C@H](CC(O)=O)c3n(Cc3ccc(Cl)cc3)c12