Reaction Details
TargetProtein kinase C alpha type
LigandBDBM50205468
Substrate/Competitorn/a
Meas. Tech.ChEMBL_442372 (CHEMBL892534)
Ki>2000±n/a nM
Citation Chen, SChen, LLe, NTZhao, CSidduri, ALou, JPMichoud, CPortland, LJackson, NLiu, JJKonzelmann, FChi, FTovar, CXiang, QChen, YWen, YVassilev, LT Synthesis and activity of quinolinyl-methylene-thiazolinones as potent and selective cyclin-dependent kinase 1 inhibitors. Bioorg Med Chem Lett17:2134-8 (2007) 
 
Protein kinase C alpha type
Name:Protein kinase C alpha type
Type:Enzyme
Mol. Mass.:76755.65
Organism:Homo sapiens (Human)
Description:The recombinant human PKC enzymes were produced using a baculovirus expression system in SF9 cells
Residue:672
BDBM50205468
NameBDBM50205468
Synonyms:(Z)-2-amino-5-(quinolin-6-ylmethylene)thiazol-4(5H)-one | CHEMBL396377
TypeSmall organic molecule
Emp. Form.C13H9N3OS
Mol. Mass.255.295
SMILESNC1=NC(=O)C(S1)=Cc1ccc2ncccc2c1