Reaction Details
TargetEphrin type-B receptor 3
LigandBDBM50205477
Substrate/Competitorn/a
Meas. Tech.ChEMBL_442377 (CHEMBL892539)
Ki>2000±n/a nM
Citation Chen, SChen, LLe, NTZhao, CSidduri, ALou, JPMichoud, CPortland, LJackson, NLiu, JJKonzelmann, FChi, FTovar, CXiang, QChen, YWen, YVassilev, LT Synthesis and activity of quinolinyl-methylene-thiazolinones as potent and selective cyclin-dependent kinase 1 inhibitors. Bioorg Med Chem Lett17:2134-8 (2007) 
 
Ephrin type-B receptor 3
Name:Ephrin type-B receptor 3
Type:Protein
Mol. Mass.:110326.17
Organism:Homo sapiens (Human)
Description:P54753
Residue:998
BDBM50205477
NameBDBM50205477
Synonyms:(Z)-2-((1R,2S)-2-phenylcyclopropylamino)-5-(quinolin-6-ylmethylene)thiazol-4(5H)-one | CHEMBL235345
TypeSmall organic molecule
Emp. Form.C22H17N3OS
Mol. Mass.371.455
SMILESO=C1N=C(N[C@@H]2C[C@H]2c2ccccc2)SC1=Cc1ccc2ncccc2c1