Reaction Details
TargetProtein kinase C delta type
LigandBDBM50205468
Substrate/Competitorn/a
Meas. Tech.ChEMBL_442373 (CHEMBL892535)
Ki 1700±n/a nM
Citation Chen, SChen, LLe, NTZhao, CSidduri, ALou, JPMichoud, CPortland, LJackson, NLiu, JJKonzelmann, FChi, FTovar, CXiang, QChen, YWen, YVassilev, LT Synthesis and activity of quinolinyl-methylene-thiazolinones as potent and selective cyclin-dependent kinase 1 inhibitors. Bioorg Med Chem Lett17:2134-8 (2007) 
 
Protein kinase C delta type
Name:Protein kinase C delta type
Type:Enzyme
Mol. Mass.:77516.79
Organism:Homo sapiens (Human)
Description:The recombinant human PKC enzymes were produced using a baculovirus expression system in SF9 cells
Residue:676
BDBM50205468
NameBDBM50205468
Synonyms:(Z)-2-amino-5-(quinolin-6-ylmethylene)thiazol-4(5H)-one | CHEMBL396377
TypeSmall organic molecule
Emp. Form.C13H9N3OS
Mol. Mass.255.295
SMILESNC1=NC(=O)C(S1)=Cc1ccc2ncccc2c1