Reaction Details
TargetRibosomal protein S6 kinase alpha-3
LigandBDBM50205468
Substrate/Competitorn/a
Meas. Tech.ChEMBL_442370 (CHEMBL892532)
Ki>2000±n/a nM
Citation Chen, SChen, LLe, NTZhao, CSidduri, ALou, JPMichoud, CPortland, LJackson, NLiu, JJKonzelmann, FChi, FTovar, CXiang, QChen, YWen, YVassilev, LT Synthesis and activity of quinolinyl-methylene-thiazolinones as potent and selective cyclin-dependent kinase 1 inhibitors. Bioorg Med Chem Lett17:2134-8 (2007) 
 
Ribosomal protein S6 kinase alpha-3
Name:Ribosomal protein S6 kinase alpha-3
Type:Serine/threonine-protein kinase
Mol. Mass.:83740.03
Organism:Homo sapiens (Human)
Description:The human RSK2 sequence differed from the Genbank entry NM_004586 at one residue, V45G. The protein was cloned and purified from baculovirus expression system.
Residue:740
BDBM50205468
NameBDBM50205468
Synonyms:(Z)-2-amino-5-(quinolin-6-ylmethylene)thiazol-4(5H)-one | CHEMBL396377
TypeSmall organic molecule
Emp. Form.C13H9N3OS
Mol. Mass.255.295
SMILESNC1=NC(=O)C(S1)=Cc1ccc2ncccc2c1