Reaction Details
TargetNitric oxide synthase, inducible
LigandBDBM50205911
Substrate/Competitorn/a
Meas. Tech.ChEMBL_428500 (CHEMBL920402)
IC50 0.48±n/a nM
Citation Davey, DDAdler, MArnaiz, DEagen, KErickson, SGuilford, WKenrick, MMorrissey, MMOhlmeyer, MPan, GParadkar, VMParkinson, JPolokoff, MSaionz, KSantos, CSubramanyam, BVergona, RWei, RGWhitlow, MYe, BZhao, ZSDevlin, JJPhillips, G Design, synthesis, and activity of 2-imidazol-1-ylpyrimidine derived inducible nitric oxide synthase dimerization inhibitors. J Med Chem50:1146-57 (2007) 
 
Nitric oxide synthase, inducible
Name:Nitric oxide synthase, inducible
Type:Homodimer
Mol. Mass.:131141.95
Organism:Homo sapiens (Human)
Description:P35228
Residue:1153
BDBM50205911
NameBDBM50205911
Synonyms:2-((R)-1-(2-(1H-imidazol-1-yl)-6-methylpyrimidin-4-yl)pyrrolidin-2-yl)-N-(benzo[d][1,3]dioxol-5-ylmethyl)acetamide | CHEMBL427062
TypeSmall organic molecule
Emp. Form.C21H22N6O3
Mol. Mass.406.4378
SMILESO=C(NCCc1ccc2OCOc2c1)[C@H]1CCCN1c1ccnc(n1)-n1ccnc1