Reaction Details
TargetNitric oxide synthase, inducible
LigandBDBM50205955
Substrate/Competitorn/a
Meas. Tech.ChEMBL_428500 (CHEMBL920402)
IC50 1.9±n/a nM
Citation Davey, DDAdler, MArnaiz, DEagen, KErickson, SGuilford, WKenrick, MMorrissey, MMOhlmeyer, MPan, GParadkar, VMParkinson, JPolokoff, MSaionz, KSantos, CSubramanyam, BVergona, RWei, RGWhitlow, MYe, BZhao, ZSDevlin, JJPhillips, G Design, synthesis, and activity of 2-imidazol-1-ylpyrimidine derived inducible nitric oxide synthase dimerization inhibitors. J Med Chem50:1146-57 (2007) 
 
Nitric oxide synthase, inducible
Name:Nitric oxide synthase, inducible
Type:Homodimer
Mol. Mass.:131141.95
Organism:Homo sapiens (Human)
Description:P35228
Residue:1153
BDBM50205955
NameBDBM50205955
Synonyms:CHEMBL220771 | N-[(1,3-benzodioxol-5-yl)methyl]-4-[2-(1H-imidazol-1-yl)-6-methylpyrimidin-4-yl]-1-[(1-methylethyl)carbonyl]-2-piperazineacetamide
TypeSmall organic molecule
Emp. Form.C26H31N7O4
Mol. Mass.505.5688
SMILESCC(C)C(=O)N1CCN(CC1CC(=O)NCc1ccc2OCOc2c1)c1cc(C)nc(n1)-n1ccnc1