Reaction Details
TargetNitric oxide synthase, inducible
LigandBDBM50205931
Substrate/Competitorn/a
Meas. Tech.ChEMBL_428500 (CHEMBL920402)
IC50 0.96±n/a nM
Citation Davey, DDAdler, MArnaiz, DEagen, KErickson, SGuilford, WKenrick, MMorrissey, MMOhlmeyer, MPan, GParadkar, VMParkinson, JPolokoff, MSaionz, KSantos, CSubramanyam, BVergona, RWei, RGWhitlow, MYe, BZhao, ZSDevlin, JJPhillips, G Design, synthesis, and activity of 2-imidazol-1-ylpyrimidine derived inducible nitric oxide synthase dimerization inhibitors. J Med Chem50:1146-57 (2007) 
 
Nitric oxide synthase, inducible
Name:Nitric oxide synthase, inducible
Type:Homodimer
Mol. Mass.:131141.95
Organism:Homo sapiens (Human)
Description:P35228
Residue:1153
BDBM50205931
NameBDBM50205931
Synonyms:CHEMBL223791 | N-(1,3-benzodioxol-5-ylmethyl)-1-[2-(1H-imidazol-yl)-4-pyrimidinyl]-4-[[(phenylmethyl)amino]carbonyl]-2-piperazineacetamide
TypeSmall organic molecule
Emp. Form.C29H30N8O4
Mol. Mass.554.5997
SMILESO=C(CC1CN(CCN1c1ccnc(n1)-n1ccnc1)C(=O)NCc1ccccc1)NCc1ccc2OCOc2c1