Reaction Details
TargetHistamine H3 receptor
LigandBDBM50206221
Substrate/Competitorn/a
Meas. Tech.ChEMBL_454704 (CHEMBL886726)
Ki 1.7±n/a nM
Citation Keith, JMGomez, LAWolin, RLBarbier, AJWilson, SJBoggs, JDMazur, CFraser, ICLord, BAluisio, LLovenberg, TWCarruthers, NI Pyrrolidino-tetrahydroisoquinolines as potent dual H3 antagonist and serotonin transporter inhibitors. Bioorg Med Chem Lett17:2603-7 (2007) 
 
Histamine H3 receptor
Name:Histamine H3 receptor
Type:G Protein-Coupled Receptor (GPCR)
Mol. Mass.:48691.47
Organism:Homo sapiens (Human)
Description:Binding assays were using CHO cells stably expressing hH3R receptors.
Residue:445
BDBM50206221
NameBDBM50206221
Synonyms:6-(3-methoxyphenyl)-9-(3-(piperidin-1-yl)propoxy)-1,2,3,5,6,10b-hexahydropyrrolo[2,1-a]isoquinoline | CHEMBL238749
TypeSmall organic molecule
Emp. Form.C27H36N2O2
Mol. Mass.420.5869
SMILESCOc1cccc(c1)C1CN2CCCC2c2cc(OCCCN3CCCCC3)ccc12