Reaction Details
TargetHistamine H3 receptor
LigandBDBM50206224
Substrate/Competitorn/a
Meas. Tech.ChEMBL_454704 (CHEMBL886726)
Ki 2±n/a nM
Citation Keith, JMGomez, LAWolin, RLBarbier, AJWilson, SJBoggs, JDMazur, CFraser, ICLord, BAluisio, LLovenberg, TWCarruthers, NI Pyrrolidino-tetrahydroisoquinolines as potent dual H3 antagonist and serotonin transporter inhibitors. Bioorg Med Chem Lett17:2603-7 (2007) 
 
Histamine H3 receptor
Name:Histamine H3 receptor
Type:G Protein-Coupled Receptor (GPCR)
Mol. Mass.:48691.47
Organism:Homo sapiens (Human)
Description:Binding assays were using CHO cells stably expressing hH3R receptors.
Residue:445
BDBM50206224
NameBDBM50206224
Synonyms:9-(3-(piperidin-1-yl)propoxy)-6-p-tolyl-1,2,3,5,6,10b-hexahydropyrrolo[2,1-a]isoquinoline | CHEMBL240466
TypeSmall organic molecule
Emp. Form.C27H36N2O
Mol. Mass.404.5875
SMILESCc1ccc(cc1)C1CN2CCCC2c2cc(OCCCN3CCCCC3)ccc12