Reaction Details
TargetPeroxisome proliferator-activated receptor alpha
LigandBDBM28700
Substrate/Competitorn/a
Meas. Tech.ChEMBL_428982 (CHEMBL919529)
EC50>10000±n/a nM
Citation Sauerberg, POlsen, GSJeppesen, LMogensen, JPPettersson, IJeppesen, CBDaugaard, JRGalsgaard, EDYnddal, LFleckner, JPanajotova, VPolivka, ZPihera, PHavranek, MWulff, EM Identification and synthesis of a novel selective partial PPARdelta agonist with full efficacy on lipid metabolism in vitro and in vivo. J Med Chem50:1495-503 (2007) 
 
Peroxisome proliferator-activated receptor alpha
Name:Peroxisome proliferator-activated receptor alpha
Type:Enzyme
Mol. Mass.:52222.08
Organism:Homo sapiens (Human)
Description:Q07869
Residue:468
BDBM28700
NameBDBM28700
Synonyms:2-(4-(4-Chlorobenzoyl)phenoxy)-2-methylpropionic acid CHEMBL981 FIBRICOR LF 153 procetofenic acid
TypeSmall organic molecule
Emp. Form.C17H15ClO4
Mol. Mass.318.752
SMILESCC(C)(Oc1ccc(cc1)C(=O)c1ccc(Cl)cc1)C(O)=O