Reaction Details
TargetPeroxisome proliferator-activated receptor delta
LigandBDBM50207468
Substrate/Competitorn/a
Meas. Tech.ChEMBL_428986 (CHEMBL919533)
EC50 5900±n/a nM
Citation Sauerberg, POlsen, GSJeppesen, LMogensen, JPPettersson, IJeppesen, CBDaugaard, JRGalsgaard, EDYnddal, LFleckner, JPanajotova, VPolivka, ZPihera, PHavranek, MWulff, EM Identification and synthesis of a novel selective partial PPARdelta agonist with full efficacy on lipid metabolism in vitro and in vivo. J Med Chem50:1495-503 (2007) 
 
Peroxisome proliferator-activated receptor delta
Name:Peroxisome proliferator-activated receptor delta
Type:Enzyme
Mol. Mass.:49910.45
Organism:Homo sapiens (Human)
Description:Q03181
Residue:441
BDBM50207468
NameBDBM50207468
Synonyms:3-{3-[3,3-bis-(4-bromo-phenyl)-allyloxy]-phenyl}-propionic acid | CHEMBL225017
TypeSmall organic molecule
Emp. Form.C24H20Br2O3
Mol. Mass.516.222
SMILES[#8]-[#6](=O)-[#6]-[#6]-c1cccc(-[#8]-[#6]\[#6]=[#6](/c2ccc(Br)cc2)-c2ccc(Br)cc2)c1