Reaction Details
TargetPeroxisome proliferator-activated receptor delta
LigandBDBM50207466
Substrate/Competitorn/a
Meas. Tech.ChEMBL_428986 (CHEMBL919533)
EC50 1100±n/a nM
Citation Sauerberg, POlsen, GSJeppesen, LMogensen, JPPettersson, IJeppesen, CBDaugaard, JRGalsgaard, EDYnddal, LFleckner, JPanajotova, VPolivka, ZPihera, PHavranek, MWulff, EM Identification and synthesis of a novel selective partial PPARdelta agonist with full efficacy on lipid metabolism in vitro and in vivo. J Med Chem50:1495-503 (2007) 
 
Peroxisome proliferator-activated receptor delta
Name:Peroxisome proliferator-activated receptor delta
Type:Enzyme
Mol. Mass.:49910.45
Organism:Homo sapiens (Human)
Description:Q03181
Residue:441
BDBM50207466
NameBDBM50207466
Synonyms:CHEMBL388540 | {4-[3,3-bis-(4-bromo-phenyl)-allyloxy]-phenyl}-acetic acid
TypeSmall organic molecule
Emp. Form.C23H18Br2O3
Mol. Mass.502.195
SMILES[#8]-[#6](=O)-[#6]-c1ccc(-[#8]-[#6]\[#6]=[#6](/c2ccc(Br)cc2)-c2ccc(Br)cc2)cc1