Reaction Details
TargetMelanin-concentrating hormone receptor 1
LigandBDBM50207677
Substrate/Competitorn/a
Meas. Tech.ChEMBL_454873 (CHEMBL886902)
IC50 20±n/a nM
Citation Judd, ASSouers, AJWodka, DZhao, GMulhern, MMIyengar, RRGao, JLynch, JKFreeman, JCFalls, HDBrodjian, SDayton, BDReilly, RMGintant, GLimberis, JTMikhail, ALeitza, STHouseman, KADiaz, GBush, ENShapiro, RKnourek-Segel, VHernandez, LEMarsh, KCSham, HLCollins, CAKym, PR Identification of diamino chromone-2-carboxamides as MCHr1 antagonists with minimal hERG channel activity. Bioorg Med Chem Lett17:2365-71 (2007) 
 
Melanin-concentrating hormone receptor 1
Name:Melanin-concentrating hormone receptor 1
Type:G Protein-Coupled Receptor (GPCR)
Mol. Mass.:45976.27
Organism:Homo sapiens (Human)
Description:Membranes from CHO-K1 cells stably expressing human MCH1R were used in assays.
Residue:422
BDBM50207677
NameBDBM50207677
Synonyms:CHEMBL248296 | N-(1-(4-(3-(dimethylamino)propoxy)-3-fluorobenzyl)piperidin-4-yl)-7-fluoro-4-oxo-4H-chromene-2-carboxamide
TypeSmall organic molecule
Emp. Form.C27H31F2N3O4
Mol. Mass.499.5495
SMILESCN(C)CCCOc1ccc(CN2CCC(CC2)NC(=O)c2cc(=O)c3ccc(F)cc3o2)cc1F