Reaction Details
TargetMelanin-concentrating hormone receptor 1
LigandBDBM50207675
Substrate/Competitorn/a
Meas. Tech.ChEMBL_454873 (CHEMBL886902)
IC50 23±n/a nM
Citation Judd, ASSouers, AJWodka, DZhao, GMulhern, MMIyengar, RRGao, JLynch, JKFreeman, JCFalls, HDBrodjian, SDayton, BDReilly, RMGintant, GLimberis, JTMikhail, ALeitza, STHouseman, KADiaz, GBush, ENShapiro, RKnourek-Segel, VHernandez, LEMarsh, KCSham, HLCollins, CAKym, PR Identification of diamino chromone-2-carboxamides as MCHr1 antagonists with minimal hERG channel activity. Bioorg Med Chem Lett17:2365-71 (2007) 
 
Melanin-concentrating hormone receptor 1
Name:Melanin-concentrating hormone receptor 1
Type:G Protein-Coupled Receptor (GPCR)
Mol. Mass.:45976.27
Organism:Homo sapiens (Human)
Description:Membranes from CHO-K1 cells stably expressing human MCH1R were used in assays.
Residue:422
BDBM50207675
NameBDBM50207675
Synonyms:CHEMBL246464 | N-(1-(3-fluoro-4-(3-(piperidin-1-yl)propanamido)benzyl)piperidin-4-yl)-7-fluoro-4-oxo-4H-chromene-2-carboxamide
TypeSmall organic molecule
Emp. Form.C30H34F2N4O4
Mol. Mass.552.6122
SMILESFc1ccc2c(c1)oc(cc2=O)C(=O)NC1CCN(Cc2ccc(NC(=O)CCN3CCCCC3)c(F)c2)CC1