Reaction Details
TargetPotassium voltage-gated channel subfamily H member 2
LigandBDBM50207679
Substrate/Competitorn/a
Meas. Tech.ChEMBL_454875 (CHEMBL886903)
IC50 11000±n/a nM
Citation Judd, ASSouers, AJWodka, DZhao, GMulhern, MMIyengar, RRGao, JLynch, JKFreeman, JCFalls, HDBrodjian, SDayton, BDReilly, RMGintant, GLimberis, JTMikhail, ALeitza, STHouseman, KADiaz, GBush, ENShapiro, RKnourek-Segel, VHernandez, LEMarsh, KCSham, HLCollins, CAKym, PR Identification of diamino chromone-2-carboxamides as MCHr1 antagonists with minimal hERG channel activity. Bioorg Med Chem Lett17:2365-71 (2007) 
 
Potassium voltage-gated channel subfamily H member 2
Name:Potassium voltage-gated channel subfamily H member 2
Type:Multi-pass membrane protein
Mol. Mass.:126672.65
Organism:Homo sapiens (Human)
Description:Q12809
Residue:1159
BDBM50207679
NameBDBM50207679
Synonyms:CHEMBL246258 | N-(1-(2-chloro-4-((2-(pyrrolidin-1-yl)ethyl)carbamoyl)benzyl)piperidin-4-yl)-7-fluoro-4-oxo-4H-chromene-2-carboxamide
TypeSmall organic molecule
Emp. Form.C29H32ClFN4O4
Mol. Mass.555.04
SMILESFc1ccc2c(c1)oc(cc2=O)C(=O)NC1CCN(Cc2ccc(cc2Cl)C(=O)NCCN2CCCC2)CC1