Reaction Details
TargetMelanin-concentrating hormone receptor 1
LigandBDBM50207679
Substrate/Competitorn/a
Meas. Tech.ChEMBL_454873 (CHEMBL886902)
IC50 2±n/a nM
Citation Judd, ASSouers, AJWodka, DZhao, GMulhern, MMIyengar, RRGao, JLynch, JKFreeman, JCFalls, HDBrodjian, SDayton, BDReilly, RMGintant, GLimberis, JTMikhail, ALeitza, STHouseman, KADiaz, GBush, ENShapiro, RKnourek-Segel, VHernandez, LEMarsh, KCSham, HLCollins, CAKym, PR Identification of diamino chromone-2-carboxamides as MCHr1 antagonists with minimal hERG channel activity. Bioorg Med Chem Lett17:2365-71 (2007) 
 
Melanin-concentrating hormone receptor 1
Name:Melanin-concentrating hormone receptor 1
Type:G Protein-Coupled Receptor (GPCR)
Mol. Mass.:45976.27
Organism:Homo sapiens (Human)
Description:Membranes from CHO-K1 cells stably expressing human MCH1R were used in assays.
Residue:422
BDBM50207679
NameBDBM50207679
Synonyms:CHEMBL246258 | N-(1-(2-chloro-4-((2-(pyrrolidin-1-yl)ethyl)carbamoyl)benzyl)piperidin-4-yl)-7-fluoro-4-oxo-4H-chromene-2-carboxamide
TypeSmall organic molecule
Emp. Form.C29H32ClFN4O4
Mol. Mass.555.04
SMILESFc1ccc2c(c1)oc(cc2=O)C(=O)NC1CCN(Cc2ccc(cc2Cl)C(=O)NCCN2CCCC2)CC1