Reaction Details
TargetCannabinoid receptor 1
LigandBDBM50208953
Substrate/Competitorn/a
Meas. Tech.ChEMBL_438557 (CHEMBL887658)
Ki 270±n/a nM
Citation Smith, RAFathi, ZAchebe, FAkuche, CBrown, SEChoi, SFan, JJenkins, SKluender, HCKonkar, ALavoie, RMays, RNatoli, JO'Connor, SJOrtiz, AASu, NTaing, CTomlinson, STritto, TWang, GWirtz, SNWong, WYang, XFYing, SZhang, Z Optimization of imidazole amide derivatives as cannabinoid-1 receptor antagonists for the treatment of obesity. Bioorg Med Chem Lett17:2706-11 (2007) 
 
Cannabinoid receptor 1
Name:Cannabinoid receptor 1
Type:G Protein-Coupled Receptor (GPCR)
Mol. Mass.:52868.96
Organism:Homo sapiens (Human)
Description:P21554
Residue:472
BDBM50208953
NameBDBM50208953
Synonyms:CHEMBL229858 | N-((1S,2S)-2-aminocyclohexyl)-1-(4-chlorophenyl)-2-(2,4-dichlorophenyl)-1H-imidazole-4-carboxamide
TypeSmall organic molecule
Emp. Form.C22H21Cl3N4O
Mol. Mass.463.787
SMILESN[C@H]1CCCC[C@@H]1NC(=O)c1cn(c(n1)-c1ccc(Cl)cc1Cl)-c1ccc(Cl)cc1